Επιγραφές δημοσίου χαρακτήρα
notation: 584
preferred label: Public inscriptions @en
type: Concept
narrower: Επιγραφές αθλητικών αγώνων

Επιγραφική
notation: 573
preferred label: Epigraphy @en
type: Concept
related: Επιγραφές αθλητικών αγώνων

HUMANITIES-THESAURUS
type: ConceptScheme

Ψηφίσματα αναγνώρισης αθλητικών αγώνων
notation: 2194
preferred label: Αthletic games recognition decrees @en
type: Concept
broader: Επιγραφές αθλητικών αγώνων

Επιγραφές αθλητικών αγώνων
broader: Επιγραφές δημοσίου χαρακτήρα
source: Κουμανούδης & Ματθαίου 1986
creator: Chrysovitsanos Gerasimos (AA) @la
creator: Χρυσοβιτσάνος Γεράσιμος (ΑΑ)
preferred label: Athletic games inscriptions @en
modified: 2018-12-03
in scheme: HUMANITIES-THESAURUS
scope note: Επιγραφές που σχετίζονται με αθλητικούς αγώνες. Το περιεχόμενο τους μπορούσε να ποικίλει, από την καθιέρωση αγώνων και την ανάδειξη τοπικών αγώνων σε ισάξιους με τους τέσσερις μεγαλύτερους εκείνων των χρόνων (Ολύμπια, Πύθια, Νέμεα, Ίσθμια), μέχρι την αναγραφή των νικητών στα αθλήματα.
scope note: Inscriptions related to athletic games. Their content could range from the introduction of athletic games and the elevation of local games to a rank equaling that of the four major games (Olympia, Pythia, Nemea, Isthmia) to the recording of the names of the winners in the contests. @en
contributor: Κατσιαδάκη Ελένη (ΑΑ)
contributor: Katsiadakis Helen (AA) @en
type: Concept
related: Επιγραφική
narrower: Ψηφίσματα αναγνώρισης αθλητικών αγώνων
narrower: Κατάλογοι νικητών αθλητικών αγώνων
status: Εκδοθείς
notation: 978
created: 2015-08-05

Κατάλογοι νικητών αθλητικών αγώνων
notation: 2193
preferred label: Catalogues of victors in athletic games @en
type: Concept
broader: Επιγραφές αθλητικών αγώνων