HUMANITIES-THESAURUS
type: ConceptScheme

Ελαιογραφίες
status: Εκδοθείς
source: The J. Paul Getty Trust 2015
in scheme: HUMANITIES-THESAURUS
preferred label: Oil paintings @en
scope note: Creative works produced in oil paint, which is pigment suspended in vegetal drying oils. @en
scope note: Έργα τέχνης φιλοτεχνημένα μέσω της χρήσης χρώματος αναμεμιγμένου με έλαια.
creator: Xiropaidis Georgios (ASFA) @de
creator: Ξηροπαϊδης Γιώργος (ΑΣΚΤ)
contributor: Ξηροπαϊδης Γιώργος (ΑΣΚΤ)
contributor: Xiropaidis Georgios (ASFA) @la
notation: 973
created: 2015-10-05
modified: 2015-10-30
type: Concept
broader: Έργα τέχνης

Έργα τέχνης
notation: 618
preferred label: Artworks @en
type: Concept
narrower: Ελαιογραφίες