Οικονομικές και δημοσιονομικές μεταρρυθμίσεις
contributor: Katsiadakis Helen (AA) @en
contributor: Κατσιαδάκη Ελένη (ΑΑ)
type: Concept
creator: Tzedopoulos Giorgos (AA) @de
creator: Τζεδόπουλος Γιώργος (ΑΑ)
in scheme: HUMANITIES-THESAURUS
scope note: Reforms that induce changes in the structure and function of the economy and of the fiscal system of a state. @en
scope note: Μεταρρυθμίσεις που επιφέρουν αλλαγές στη δομή και λειτουργία της οικονομίας και του δημοσιονομικού συστήματος ενός κράτους.
modified: 2018-11-08
source: Jones & Claeys 2011
broader: Μεταρρυθμίσεις
status: Εκδοθείς
notation: 963
preferred label: Economic and financial reforms @en
created: 2015-11-02

HUMANITIES-THESAURUS
type: ConceptScheme

Μεταρρυθμίσεις
notation: 708
preferred label: Reforms @en
type: Concept
narrower: Οικονομικές και δημοσιονομικές μεταρρυθμίσεις