HUMANITIES-THESAURUS
type: ConceptScheme

Narrator
notation: 542
preferred label: Αφηγητής @el
preferred label: Narrateur @fr
type: Concept
narrower: Omniscient narrator

Omniscient narrator
preferred label: Παντογνώστης αφηγητής @el
scope note: Narrative technique in which the narrator knows more than the characters in the plot. He may know the facts about all of the protagonists, as well as their thoughts and gestures. This is a third person narrative form.
scope note: Αφηγητής ο οποίος γνωρίζει περισσότερα απ' ό,τι γνωρίζει ο ήρωας ή οποιοδήποτε πρόσωπο της δράσης, είναι πανταχού και πάντα παρών (γ’ ρηματικό πρόσωπο). @el
type: Concept
broader: Narrator
created: 2015-10-13
related: Zero focalization
contributor: Κατσιαδάκη Ελένη (ΑΑ) @el
contributor: Katsiadakis Helen (AA)
notation: 953
source: Burroway & Stuckey-French 2015
in scheme: HUMANITIES-THESAURUS
status: Εκδοθείς
modified: 2018-11-09
creator: Kalafata Patritsia (AA)
creator: Καλαφατά Πατρίτσια (ΑΑ) @el

Zero focalization
notation: 871
preferred label: Μηδενική εστίαση @el
type: Concept
related: Omniscient narrator