HUMANITIES-THESAURUS
type: ConceptScheme

Γελοιογραφίες
modified: 2015-10-30
status: Εκδοθείς
preferred label: Caricatures @en
scope note: Έργα τέχνης, συνήθως προσωπογραφίες, στις οποίες διαφοροποιούνται ή παραμορφώνονται τυπικά χαρακτηριστικά των εικονιζομένων για να προκληθεί κωμική εντύπωση.
scope note: Artworks, usually portraitures, in which the characteristic features of the subjects are exaggerated or distorted for comic effect. @en
in scheme: HUMANITIES-THESAURUS
broader: Έργα τέχνης
type: Concept
creator: Ξηροπαϊδης Γιώργος (ΑΣΚΤ)
creator: Xiropaidis Georgios (ASFA) @de
created: 2015-10-29
source: Clarke 2001
source: Πανεπιστήμιο της Οξφόρδης 1997
contributor: Xiropaidis Georgios (ASFA) @la
contributor: Ξηροπαϊδης Γιώργος (ΑΣΚΤ)
notation: 910

Έργα τέχνης
notation: 618
preferred label: Artworks @en
type: Concept
narrower: Γελοιογραφίες