HUMANITIES-THESAURUS
type: ConceptScheme

Ιστιοφόρα πλοία
notation: 372
preferred label: Sailing ships @en
type: Concept
narrower: Λατινάδικα

Λατινάδικα
broader: Ιστιοφόρα πλοία
status: Εκδοθείς
creator: Τζεδόπουλος Γιώργος (ΑΑ)
creator: Tzedopoulos Giorgos (AA) @de
preferred label: Lateen rigged ships @en
contributor: Κατσιαδάκη Ελένη (ΑΑ)
contributor: Katsiadakis Helen (AA) @en
modified: 2018-11-06
notation: 898
scope note: Μεγάλα ιστιοφόρα στη Μεσόγειο των πρώιμων νεότερων και νεότερων χρόνων. Τα λατινάδικα είχαν αρχικά δύο και μετά τα μέσα του 18ου αιώνα τρία κατάρτια με τριγωνικά πανιά, τα λατίνια, από τα οποία πήραν και το όνομά τους.
scope note: Big sailing ships that sailed in the Mediterranean during the early modern and modern period. Lateen-rigged ships had initially two and after the mid-18th century three masts with triangular sails, called lateens, which gave this type of ship its name. @en
source: Τζαμτζής 1972
created: 2015-04-30
type: Concept
in scheme: HUMANITIES-THESAURUS