HUMANITIES-THESAURUS
type: ConceptScheme

Ιστορικές επαγγελματικές ομάδες
notation: 2636
preferred label: Historical occupational groups @en
type: Concept
narrower: Ντελάληδες

Ντελάληδες
created: 2015-10-19
contributor: Φαλιέρου Αναστασία (ΑΑ)
contributor: Falierou Anastasia (AA) @fr
preferred label: Town criers @en
scope note: Δημόσιοι κήρυκες που ανάγγελλαν μεγαλόφωνα ειδήσεις ή γεγονότα στις γειτονιές των πόλεων ή των χωριών.
scope note: Public preachers, who announced news or events in the neighborhoods of cities or villages in a loud voice. @en
source: Χαραλαμπάκης 2014
status: Εκδοθείς
in scheme: HUMANITIES-THESAURUS
creator: Φαλιέρου Αναστασία (ΑΑ)
creator: Falierou Anastasia (AA) @la
type: Concept
notation: 889
modified: 2020-10-20
broader: Ιστορικές επαγγελματικές ομάδες