HUMANITIES-THESAURUS
type: ConceptScheme

Ιστορικές επαγγελματικές ομάδες
notation: 2636
preferred label: Historical occupational groups @en
type: Concept
narrower: Καραγκιοζοπαίχτες

Καραγκιοζοπαίχτες
broader: Ιστορικές επαγγελματικές ομάδες
type: Concept
contributor: Φαλιέρου Αναστασία (ΑΑ)
contributor: Falierou Anastasia (AA) @fr
notation: 750
modified: 2020-10-20
source: Δαφέρμος 2007
preferred label: Puppeteers @en
in scheme: HUMANITIES-THESAURUS
scope note: Puppeteers who manipulate the figures and create the voices of all the roles of a story in the karagiozis shadow theater. The puppeteers were sometimes accompanied by a singer. They also had assistants to hold the figures and to clap their hands. @en
scope note: Καλλιτέχνες οι οποίοι κινούν τις φιγούρες και αποδίδουν τις φωνές των προσώπων κάθε ιστορίας στο θέατρο σκιών. Μερικές φορές τους καραγκιοζοπαίχτες συνόδευε και ένας τραγουδιστής. Οι καραγκιοζοπαίχτες είχαν και βοηθούς για να κρατούν τις φιγούρες και να κτυπούν παλαμάκια.
created: 2015-10-28
creator: Φαλιέρου Αναστασία (ΑΑ)
creator: Falierou Anastasia (AA) @la
status: Εκδοθείς