HUMANITIES-THESAURUS
type: ConceptScheme

Σκηνικοί χώροι
notation: 128
preferred label: Bühnenräume @de
preferred label: Espaces scéniques @fr
preferred label: Stage spaces @en
type: Concept
related: Δραματικοί χώροι

Δραματικοί χώροι
creator: Goulis Helen (AA) @de
creator: Γουλή Ελένη (ΑΑ)
scope note: The dramatic space constitutes the fictional space conceived by the playwright, where the play is set, not always identical with the stage space. It comprises spatial information included in the stage directions as well as the spaces of action occurring off scene or in another time, brought on stage by the characters’ narratives. @en
scope note: Ο δραματικός χώρος αποτελεί το φανταστικό, επινοημένο από το θεατρικό συγγραφέα χώρο, όπου διαδραματίζεται ένα έργο, και δεν είναι πάντα ταυτόσημος με το σκηνικό χώρο. Περιλαμβάνει τις χωρικές πληροφορίες που υπάρχουν στις σκηνικές οδηγίες, καθώς και τους τόπους της δράσης που εκτυλίσσεται εκτός σκηνής ή σε άλλο χρόνο, και η οποία μεταφέρεται επί σκηνής με αφηγήσεις των δραματικών προσώπων.
in scheme: HUMANITIES-THESAURUS
type: Concept
preferred label: Dramatische Räume @de
preferred label: Dramatic spaces @en
preferred label: Espaces dramatiques @fr
contributor: Κατσιαδάκη Ελένη (ΑΑ)
contributor: Katsiadakis Helen (AA) @en
source: Pavis 2006
source: Mavromoustakos 1987
source: Πεφάνης 1999
modified: 2019-02-12
status: Εκδοθείς
broader: Πληροφοριακά αντικείμενα
related: Σκηνικοί χώροι
notation: 728
created: 2015-10-21

Πληροφοριακά αντικείμενα
notation: 240
preferred label: Information objects @en
type: Concept
narrower: Δραματικοί χώροι