HUMANITIES-THESAURUS
type: ConceptScheme

Θέατρο σκιών
creator: Goulis Helen (AA) @la
creator: Γουλή Ελένη (ΑΑ)
contributor: Katsiadakis Helen (AA) @en
contributor: Κατσιαδάκη Ελένη (ΑΑ)
scope note: Form of improvisational folk theatre with a century- long course from Asia tο the Mediterranean. It is based in orality (memorisation), empirical learning (artistry) and is a primarily collective anonymous creation. It is performed with flat articulated cut-out figures painted on paper, leather or other material against a white screen lighted from the back. The artists of shadow theatre move the figures, the result being that the audience sees the silhouettes or/and the colours -depending of the figures used. The Greek shadow theatre is Karagiozis, deriving from the Turkish Karagöz. @en
scope note: Λαϊκό αυτοσχεδιαστικό είδος θεάτρου, με μακραίωνη διαδρομή από την Ασία έως τη Μεσόγειο, βασίζεται στην προφορικότητα (απομνημόνευση), την εμπειρική εκμάθηση (δεξιοτεχνία) και αποτελεί κατεξοχήν συλλογική ανώνυμη δημιουργία. Παίζεται με τη βοήθεια ζωγραφισμένων εικόνων σε χαρτί, δέρμα ή άλλο υλικό, πάνω σε μια λευκή οθόνη που φωτίζεται από πίσω. Οι καλλιτέχνες του θεάτρου σκιών χειρίζονται τις φιγούρες δίνοντάς τους κίνηση, με αποτέλεσμα ο θεατής να βλέπει καθαρά τα περιγράμματα ή -ανάλογα με την κατασκευή- και τα χρώματά τους. Ο ελληνικός του εδαφισμός είναι ο γνωστός Καραγκιόζης, προερχόμενος από τον τούρκικο Karagöz.
notation: 632
in scheme: HUMANITIES-THESAURUS
type: Concept
source: Χατζηπανταζής 1984
source: Δαμιανάκος 1993
source: Σηφάκης 1984
source: Πούχνερ 1989
preferred label: Shadow theatre @en
preferred label: Théâtre d'ombres @fr
preferred label: Schattentheater @de
status: Εκδοθείς
broader: Πληροφοριακά αντικείμενα
created: 2015-10-30
modified: 2019-02-12

Πληροφοριακά αντικείμενα
notation: 240
preferred label: Information objects @en
type: Concept
narrower: Θέατρο σκιών