HUMANITIES-THESAURUS
type: ConceptScheme

Καλλιτεχνικά ρεύματα
notation: 27
type: Concept
narrower: Μεταμοντερνισμός

Μεταμοντερνισμός
preferred label: Postmodernism @en
notation: 57
created: 2015-10-15
scope note: A term which describes the reactions to the dominance of Modernism in architecture and the visual arts. It came into use in the 1970s, at first mainly in connection with architecture, and then later with the visual and decorative arts. To the extent that Modern "isms" establish a formal attitude to both the making and critiquing of art, Postmodernism rejects that approach in favor of Eclecticism. @en
scope note: Ο όρος απέκτησε ευρύτατη διάδοση μετά το 1970. Στη ζωγραφική πήρε την έννοια του "τέλους του Mοντερνισμού" και δήλωνε την τάση αξιοποίησης όλων των δυνατοτήτων του ιστορικού παρελθόντος χωρίς οποιαδήποτε προκατάληψη.
contributor: Βερναρδάκη Ελένη (ΑΑ)
contributor: Vernardaki Eleni (AA) @fr
type: Concept
source: Frazier 2000
source: Clarke 2001
source: Λυδάκης 2009
status: Εκδοθείς
modified: 2019-11-20
in scheme: HUMANITIES-THESAURUS
creator: Xiropaidis Georgios (ASFA) @de
creator: Ξηροπαϊδης Γιώργος (ΑΣΚΤ)
broader: Καλλιτεχνικά ρεύματα