Θεσμοί
notation: 50
preferred label: Institutions (norms) @en
type: Concept
narrower: Κοινωνικοί θεσμοί

Γάμος (θεσμός)
notation: 731
preferred label: Marriage @en
type: Concept
broader: Κοινωνικοί θεσμοί

HUMANITIES-THESAURUS
type: ConceptScheme

Κοινωνικοί θεσμοί
scope note: Regulative norms that consolidate the fabric of social relations, establish patterns of collective behaviour and steer collective action towards the accomplishment of socially important objectives. @en
scope note: Κανονιστικά πρότυπα που παγιώνουν πλέγματα κοινωνικών σχέσεων, τρόπους συλλογικής συμπεριφοράς και κοινής δράσης, προς την επίτευξη κοινωνικά σημαντικών σκοπών.
contributor: Katsiadakis Helen (AA) @de
contributor: Κατσιαδάκη Ελένη (ΑΑ)
in scheme: HUMANITIES-THESAURUS
creator: Souyioultzoglou Iraklitos (AA) @de
creator: Σουγιουλτζόγλου Ηράκλειτος (ΑΑ)
preferred label: Social institutions @en
notation: 559
broader: Θεσμοί
narrower: Γάμος (θεσμός)
narrower: Οικογένεια (θεσμός)
created: 2015-05-25
source: Τσαούσης 1989
modified: 2020-08-26
type: Concept
status: Εκδοθείς

Οικογένεια (θεσμός)
notation: 780
preferred label: Family (institution) @en
type: Concept
broader: Κοινωνικοί θεσμοί