HUMANITIES-THESAURUS
type: ConceptScheme

Propositional objects
notation: 25
preferred label: Προτασιακά αντικείμενα @el
type: Concept
narrower: Anthropological theories of kinship

Anthropological theories of kinship
creator: Souyioultzoglou Iraklitos (AA)
creator: Σουγιουλτζόγλου Ηράκλειτος (ΑΑ) @el
preferred label: Ανθρωπολογικές θεωρίες της συγγένειας @el
modified: 2020-05-06
broader: Propositional objects
contributor: Κατσιαδάκη Ελένη (ΑΑ) @el
contributor: Katsiadakis Helen (AA)
source: Τουντασάκη 2013
scope note: Θεωρητικά ερμηνευτικά συστήματα της Ανθρωπολογίας, που αναφέρονται στις δομές συγγένειας και στις κοινωνικές σχέσεις που τις διέπουν. @el
scope note: Theoretical models used in Anthropology in order to describe and interpret structures of kinship and the corresponding social relationships.
in scheme: HUMANITIES-THESAURUS
type: Concept
notation: 55
status: Εκδοθείς
created: 2015-05-04