HUMANITIES-THESAURUS
type: ConceptScheme

Κράτη
notation: 133
preferred label: States @en
type: Concept
narrower: Εθνικά κράτη

Εθνικά κράτη
scope note: State organizations that rule over a territory in the name of the political community of the nation. Nation-states emerged in the modern period through economic, social and ideological processes. @en
scope note: Κρατικές οργανώσεις που ασκούν εξουσία επί μιας επικράτειας στο όνομα της πολιτικής κοινότητας του έθνους. Τα εθνικά κράτη αναδύονται ως παράγωγα οικονομικών, κοινωνικών και ιδεολογικών εξελίξεων κατά την εποχή της νεωτερικότητας.
contributor: Κατσιαδάκη Ελένη (ΑΑ)
contributor: Katsiadakis Helen (AA) @en
notation: 537
creator: Tzedopoulos Giorgos (AA) @de
creator: Τζεδόπουλος Γιώργος (ΑΑ)
created: 2015-08-05
source: Roeder 2007
type: Concept
preferred label: Nation-states @en
in scheme: HUMANITIES-THESAURUS
broader: Κράτη
status: Εκδοθείς
modified: 2018-11-06