HUMANITIES-THESAURUS
type: ConceptScheme

Κοινωνικές ομάδες
notation: 127
preferred label: Social groups @en
type: Concept
narrower: Κοινωνικές ελίτ

Κοινωνικές ελίτ
created: 2015-06-11
preferred label: Social elites @en
creator: Tzedopoulos Giorgos (AA) @fr
creator: Τζεδόπουλος Γιώργος (ΑΑ)
scope note: Groups of individuals who hold leading positions at the top of social organizations and institutions. The members of the elites have dense interaction with each other and develop a sense of common ethics and interests. @en
scope note: Ομάδες προσώπων που κατέχουν ηγετικές θέσεις στην κορυφή κοινωνικών οργανισμών και θεσμών. Τα μέλη των ελίτ αναπτύσσουν μεταξύ τους έντονη διάδραση και διακρίνονται από κοινό ήθος και αντίληψη κοινών συμφερόντων.
source: Giddens 1974
modified: 2018-11-06
contributor: Κατσιαδάκη Ελένη (ΑΑ)
contributor: Katsiadakis Helen (AA) @en
type: Concept
status: Εκδοθείς
broader: Κοινωνικές ομάδες
in scheme: HUMANITIES-THESAURUS
notation: 534