HUMANITIES-THESAURUS
type: ConceptScheme

Ιδεολογίες
notation: 352
preferred label: Ideologies @en
type: Concept
narrower: Ρατσιστικές ιδεολογίες

Ρατσιστικές ιδεολογίες
notation: 394
status: Εκδοθείς
preferred label: Racist ideologies @en
creator: Tzedopoulos Giorgos (AA) @la
creator: Τζεδόπουλος Γιώργος (ΑΑ)
in scheme: HUMANITIES-THESAURUS
related: Ευγονική
broader: Ιδεολογίες
scope note: Ιδεολογίες που επινοούν και ορίζουν την έννοια της φυλής ως κυρίαρχης και αξιολογικής διάκρισης μεταξύ των ανθρώπων, και νομιμοποιούν μέσω αυτής της διάκρισης την ύπαρξη ή την επιβολή της θεσμικής ανισότητας και των σχέσεων εξουσίας και εκμετάλλευσης εκ μέρους των θεωρούμενων ως ανώτερων προς τις θεωρούμενες ως κατώτερες φυλές.
scope note: Ideologies that conceive and define race as a dominant value-laden distinction between humans. With this distinction, racist ideologies seek to legitimize the existence or the enforcement of institutional inequality and exploitation power relations between races deemed as superior and those rated as inferior. @en
modified: 2018-11-08
contributor: Κατσιαδάκη Ελένη (ΑΑ)
contributor: Katsiadakis Helen (AA) @en
type: Concept
source: Reilly, Kaufman & Bodino 2003
created: 2015-11-02

Ευγονική
notation: 2629
preferred label: Eugenics @en
type: Concept
related: Ρατσιστικές ιδεολογίες