HUMANITIES-THESAURUS
type: ConceptScheme

Έννοιες
notation: 28
preferred label: Concepts @en
type: Concept
narrower: Αγαθό

Αγαθό
scope note: Καθετί καλό, υλικό ή άυλο, που έχει αξία και το επιθυμεί κάθε άνθρωπος και γι αυτό αποτελεί κίνητρο για όλες τις πράξεις του. Το Αγαθόν αποτελεί θεμελιώδη έννοια στην ηθική φιλοσοφία για τη συγκρότηση κάθε συστήματος ηθικής θεωρίας.
status: Εκδοθείς
source: Μπαμπινιώτης 2005
source: Audi 2011
source: Mautner 2000
modified: 2018-04-05
type: Concept
notation: 358
created: 2015-05-03
broader: Έννοιες
alternative label: Goodness @en
creator: Σίνου Χριστίνα (ΑΑ)
creator: Sinou Christina (AA) @de
contributor: Katsiadakis Helen (AA) @en
contributor: Κατσιαδάκη Ελένη (ΑΑ)
preferred label: Good @en
in scheme: HUMANITIES-THESAURUS