HUMANITIES-THESAURUS
type: ConceptScheme

Μινιμαλισμός
notation: 269
scope note: Καλλιτεχνικό κίνημα και ύφος της δεκαετίας του 1960. Ξεκίνησε από τις Ηνωμένες Πολιτείες και αρχικά αφορούσε κυρίως τρισδιάστατα. Ο Μινιμαλισμός τείνει προς την αφαίρεση, προσπαθώντας να επιστρέψει σε πρωταρχικές δομές, χωρίς διακοσμητικά πρόσθετα αντικείμενα.
scope note: A type of abstract art, which is characterized by simplicity of form and a deliberate lack of expressive content. Its aim is a concentration on the pure qualities of colour, form, space, and materials without the distractions of "composition". It first emerged in the 1950s and flourished in the 1960s and 1970s. Minimal art was mainly an american phenomenon. @en
source: Frazier 2000
source: Λυδάκης 2009
source: Ρηντ κ.ά. 1986
source: Clarke 2001
type: Concept
created: 2015-10-15
creator: Ξηροπαϊδης Γιώργος (ΑΣΚΤ)
creator: Xiropaidis Georgios (ASFA) @de
modified: 2019-11-20
alternative label: Τέχνη του Ελαχίστου
alternative label: Minimal Art @en
alternative label: Ελάχιστη Τέχνη
broader: Καλλιτεχνικά ρεύματα
in scheme: HUMANITIES-THESAURUS
status: Εκδοθείς
contributor: Vernardaki Eleni (AA) @fr
contributor: Βερναρδάκη Ελένη (ΑΑ)
preferred label: Minimalism @en

Καλλιτεχνικά ρεύματα
notation: 27
type: Concept
narrower: Μινιμαλισμός