Κόσμος (αρχαία Γόρτυνα)
in scheme: HUMANITIES-THESAURUS
contributor: Katsiadakis Helen (AA) @en
contributor: Κατσιαδάκη Ελένη (ΑΑ)
preferred label: Kosmos (ancient Gortyn) @en
type: Concept
creator: Ιακωβίδου Αθηνά (ΑΑ)
creator: Iakovidou Athena (AA) @fr
broader: Πολιτικά αξιώματα
source: Gagarin & Perlman 2016
source: Arnaoutoglou 1998
status: Εκδοθείς
scope note: The chief office in ancient Gortyn. They were ten in number and were elected from certain tribes only. Their duties included leading in war, religious duties, adjudicating cases where foreigners were involved, adoption, caring for an heiress, and introducing laws for approval to the assembly of the citizens. @en
scope note: Το ανώτατο αξίωμα στην αρχαία Γόρτυνα. Ήταν δέκα στον αριθμό και εκλέγονταν μόνο από συγκεκριμένες φυλές. Μεταξύ των καθηκόντων τους ήταν να ηγούνται στον πόλεμο, είχαν επίσης θρησκευτικά αξιώματα, επιδίκαζαν υποθέσεις στις οποίες εμπλέκονταν ξένοι, ασχολούνταν με υιοθεσίες και τη φροντίδα των κληρονόμων και με την θέσπιση νόμων προς έγκριση από την συνέλευση των πολιτών.
notation: 2619
modified: 2020-10-19
created: 2020-09-19
related: Κόσμοι (Συλλογικές αρχές)

HUMANITIES-THESAURUS
type: ConceptScheme

Κόσμοι (Συλλογικές αρχές)
notation: 2618
preferred label: Kosmoi (Collective authorities) @en
type: Concept
related: Κόσμος (αρχαία Γόρτυνα)

Πολιτικά αξιώματα
notation: 1696
preferred label: Political offices @en
type: Concept
narrower: Κόσμος (αρχαία Γόρτυνα)