HUMANITIES-THESAURUS
type: ConceptScheme

Ένδεκα (Συλλογικές αρχές)
notation: 2617
status: Εκδοθείς
preferred label: Eleven (Collective authorities) @en
created: 2020-09-19
source: Arnaoutoglou 1998
source: Σακελλαρίου 2004
contributor: Katsiadakis Helen (AA) @en
contributor: Κατσιαδάκη Ελένη (ΑΑ)
type: Concept
modified: 2020-10-10
creator: Ιακωβίδου Αθηνά (ΑΑ)
creator: Iakovidou Athena (AA) @la
scope note: Magistrates, selected by lot, in ancient Athens. They acted as caretakers for those imprisoned. Thieves and people enslaving free persons arrested in the act were immediately put to death by them, if they admitted their crime; if they did not, each case was introduced before the court. If the court decided that the defendant had committed the crime he was accused of, the Eleven were responsible for his execution. The Eleven also introduced cases of disputed property before the court before confiscation. @en
scope note: Κληρωτοί άρχοντες που απαντούν στην αρχαία Αθήνα. Αρμοδιότητά τους ήταν η εποπτεία των φυλακισμένων. Κλέφτες και ανδραποδιστές που συλλαμβάνονταν επ' αυτοφώρω άμεσα θανατώνονταν από αυτούς, αν ομολογούσαν το έγκλημά τους. Εαν όχι, οδηγούνταν στο δικαστήριο και, αν αποφασιζόταν η ενοχή τους, οι Ένδεκα ήταν υπεύθυνοι για την θανάτωσή τους. Επίσης, οι Ένδεκα παρέπεμπαν υποθέσεις αμφισβητούμενης περιουσίας στο δικαστήριο πριν από την δήμευση.
in scheme: HUMANITIES-THESAURUS
broader: Συλλογικές αρχές (αρχαία Ελλάδα)

Συλλογικές αρχές (αρχαία Ελλάδα)
notation: 2622
preferred label: Collective authorities (ancient Greece) @en
type: Concept
narrower: Ένδεκα (Συλλογικές αρχές)