Παραμύθια
notation: 260
preferred label: Fairy tales @en
type: Concept
related: Λαογραφία
broader: Προτασιακά αντικείμενα
contributor: Katsiadakis Helen (AA) @en
contributor: Κατσιαδάκη Ελένη (ΑΑ)
in scheme: HUMANITIES-THESAURUS
source: Zipes 2013
created: 2015-04-21
modified: 2020-08-30
creator: Souyioultzoglou Iraklitos (AA) @la
creator: Σουγιουλτζόγλου Ηράκλειτος (ΑΑ)
scope note: Σύντομες διδακτικές ιστορίες με αλληγορικές αναφορές που εκτυλίσσονται σε διαδοχικά επεισόδια και αφηγούνται τις περιπέτειες φανταστικών χαρακτήρων, ενσωματώνοντας στοιχεία του φυσικού και του υπεφυσικού κόσμου.
scope note: EN: Short educational stories with allegorical connotations that unfold in consecutive acts and feature imaginary characters as well as elements of the natural and supernatural realms. @en
status: Εκδοθείς

HUMANITIES-THESAURUS
type: ConceptScheme

Προτασιακά αντικείμενα
notation: 25
preferred label: Propositional objects @en
type: Concept
narrower: Παραμύθια

Λαογραφία
notation: 613
preferred label: Folkloristics @en
type: Concept
related: Παραμύθια