HUMANITIES-THESAURUS
type: ConceptScheme

Διαχείριση ομάδας
status: Εκδοθείς
preferred label: Group management @en
notation: 259
scope note: Περιλαμβάνει σύνθετες ενέργειες από δύο τουλάχιστον άτομα που αποσκοπούν στη σύναψη, μετατροπή, ή διάλυση οποιασδήποτε μορφής (νομικά αναγνωρισμένης, ή εκτός νόμου) ενωτικής σχέσης οποιουδήποτε χαρακτήρα (οικονομικού, θρησκευτικού, αθλητικού, πολιτικού, κτλ.) και η οποία παρουσιάζει οργανωτικά χαρακτηριστικά. Προϋπόθεση για τη σύναψη, μετατροπή ή διάλυση οποιασδήποτε μορφής ενωτικής σχέσης οποιουδήποτε χαρακτήρα αποτελεί η από κοινού υιοθέτηση κάποιων πεποιθήσεων, στόχων και αποφάσεων ή/και η από κοινού επιτέλεση κάποιων ενεργειών.
scope note: This term classifies complex activities carried out by at least two individuals aimed at forming, modifying or dissolving any form (legal or illegal) of unitary relationships of any kind (economic, religious, athletic, political, etc.), which exhibit organizational characteristics. A precondition for the formation, modification or dissolution of these kinds of unitary relations is the adoption of certain common beliefs, goals, decisions and/ or shared actions. @en
contributor: Κατσιαδάκη Ελένη (ΑΑ)
contributor: Katsiadakis Helen (AA) @fr
created: 2015-01-22
type: Concept
in scheme: HUMANITIES-THESAURUS
modified: 2020-03-25
broader: Γεγονότα - συμβάντα
creator: admin

Γεγονότα - συμβάντα
notation: 20
preferred label: Events @en
type: Concept
narrower: Διαχείριση ομάδας