Μετεωρολογία
notation: 2501
preferred label: Meteorology @en
type: Concept
related: Βαρόμετρα

HUMANITIES-THESAURUS
type: ConceptScheme

Βαρόμετρα
source: Feldman 2005a
source: Daintith & Martin 2010
scope note: Επιστημονικά όργανα για τη μέτρηση της ατμοσφαιρικής πίεσης. Οι δύο βασικοί τύποι βαρόμετρου είναι το βαρόμετρο υδραργύρου και το ανηροειδές ή μεταλλικό βαρόμετρο. Το βαρόμετρο υδραργύρου προέκυψε στο πλαίσιο ερευνών και επιδείξεων για την ύπαρξη κενού κατά το πρώτο μισό του 17ου αιώνα, και στη συνέχεια χρησιμοποιήθηκε για τη μέτρηση των διακυμάνσεων της πίεσης του αέρα και την υψομέτρηση. Το μεταλλικό βαρόμετρο κατασκευάστηκε γύρω στα μέσα του 19ου αιώνα και έγινε δημοφιλές στους ορειβάτες και τους ναυτικούς λόγω της αντοχής και της ευκολίας στη μεταφορά του.
scope note: Scientific instruments for measuring atmospheric pressure. The two main types are the mercury barometer and the aneroid barometer. The mercury barometer grew out of investigations and demonstations for the existence of vacuum in the first half of the 17th century and was later used as an instrument to measure the variation in pressure of the air and the heights. The aneroid barometer was constructed in the middle of the 19th century and became popular among mountaineers and mariners due to its robustness and portability. @en
type: Concept
creator: Μεργούπη-Σαβαΐδου Ειρήνη (ΑΑ)
creator: Mergoupi-Savaidou Eirini (AA) @en
contributor: Katsiadakis Helen (AA) @en
contributor: Κατσιαδάκη Ελένη (ΑΑ)
preferred label: Barometers @en
created: 2020-05-27
broader: Επιστημονικά όργανα
related: Μετεωρολογία
status: Εκδοθείς
notation: 2500
modified: 2020-06-29
in scheme: HUMANITIES-THESAURUS

Επιστημονικά όργανα
notation: 1888
preferred label: Scientific instruments @en
type: Concept
narrower: Βαρόμετρα