Aρχιθεωρός (περίοδος πόλης-κράτους)
notation: 2499
preferred label: Architheoros (city-state period) @en
type: Concept
related: Θεωρός (περίοδος πόλης-κράτους)

HUMANITIES-THESAURUS
type: ConceptScheme

Θεωροδόκος (περίοδος πόλης-κράτους)
notation: 2497
preferred label: Theorodokos (city-state period) @en
type: Concept
related: Θεωρός (περίοδος πόλης-κράτους)

Πολιτικά αξιώματα
notation: 1696
preferred label: Political offices @en
type: Concept
narrower: Θεωρός (περίοδος πόλης-κράτους)

Θεωρίαι
notation: 2498
preferred label: Theoriai @en
type: Concept
related: Θεωρός (περίοδος πόλης-κράτους)

Θεωρός (περίοδος πόλης-κράτους)
broader: Πολιτικά αξιώματα
in scheme: HUMANITIES-THESAURUS
creator: Χρυσοβιτσάνος Γεράσιμος (ΑΑ)
creator: Chrysovitsanos Gerasimos (AA) @fr
created: 2020-05-27
status: Εκδοθείς
related: Aρχιθεωρός (περίοδος πόλης-κράτους)
related: Θεωρίαι
related: Θεωροδόκος (περίοδος πόλης-κράτους)
scope note: Αξίωμα που απαντά στην αρχαία Ελλάδα. Οι θεωροί μιας πόλης είχαν το κύριο καθήκον να εκπροσωπήσουν την πόλη τους σε εορτές μιας άλλης. Στις εορτές που παρίσταντο προσέφεραν θυσίες στο όνομα της πόλης τους. Σε άλλες περιπτώσεις λειτουργούσαν ως απεσταλμένοι σε ένα μαντείο προκειμένου να λάβουν χρησμό. Από τον 3ο αιώνα π.Χ. οι θεωροί αναλάμβαναν την ανακοίνωση των Πανελλήνιων αγώνων σε όλα τα ελληνικά κράτη.
scope note: An office that appears in ancient Greece. The theoroi were a city's representatives at another city's festival. At the festivals the theoroi offered sacrifices in the name of their cities. In other cases, they acted as envoys to receive an oracle from a sanctuary. From the 3rd century BC. theoroi made the announcements of the Panhellenic games to all Greek states. @en
source: Fontenrose & Spawforth 2012
source: Klaffenbach 2003
source: Dillon 1997
type: Concept
contributor: Κατσιαδάκη Ελένη (ΑΑ)
contributor: Katsiadakis Helen (AA) @en
modified: 2020-10-10
notation: 2496
preferred label: Theoros (city-state period) @en