Προεδρία (προνόμιο στην αρχαία Αθήνα)
notation: 2444
preferred label: Prohedria (privilege in ancient Athens) @en
type: Concept
related: Ίδρυση ανδριάντος (απονομή τιμής)

HUMANITIES-THESAURUS
type: ConceptScheme

Προτασιακά αντικείμενα
notation: 25
preferred label: Propositional objects @en
type: Concept
narrower: Ίδρυση ανδριάντος (απονομή τιμής)

Τιμητικά ψηφίσματα
notation: 1218
preferred label: Honorific decrees @en
type: Concept
related: Ίδρυση ανδριάντος (απονομή τιμής)

Ίδρυση ανδριάντος (απονομή τιμής)
in scheme: HUMANITIES-THESAURUS
scope note: Τιμή που απονέμονταν σε Αθηναίους πολίτες και ξένους με τιμητικά ψηφίσματα στην αρχαία Αθήνα. Στο βάθρο του ανδριάντος αναγράφονταν εν συντομία οι λόγοι απονομής της τιμής, όπως ήταν η επίτευξη ενός σπουδαίου κατορθώματος ή οι ευεργεσίες υπέρ της πόλεως ή ακόμα και η άρτια εκτέλεση των καθηκόντων που είχαν ανατεθεί στον τιμώμενο. Κατά τα ελληνιστικά χρόνια, η ίδρυση ανδριάντος έγινε συνηθισμένη τιμή, ιδιαίτερα όταν αποδίδονταν τιμές σε ηγεμόνες.
scope note: An honor awarded to Athenian citizens and foreigners in ancient Athens. The pedestal of the statue was inscribed with a brief statement of the reasons for the award of the honor, such as the achievement of an important feat, or the benefactions on behalf of the city, or even the fine execution of the duties assigned to the honorand. During the Hellenistic period, the erection of a statue became commonplace, particularly when honors were being awarded to rulers. @en
broader: Προτασιακά αντικείμενα
modified: 2020-09-17
notation: 2445
creator: Χρυσοβιτσάνος Γεράσιμος (ΑΑ)
creator: Chrysovitsanos Gerasimos (AA) @fr
preferred label: Erection of a statue (honor awarded) @en
contributor: Κατσιαδάκη Ελένη (ΑΑ)
contributor: Katsiadakis Helen (AA) @en
source: Θέμος 2007
type: Concept
related: Προεδρία (προνόμιο στην αρχαία Αθήνα)
related: Σίτιση στο πρυτανείο (προνόμιο στην αρχαία Αθήνα)
related: Τιμητικά ψηφίσματα
status: Εκδοθείς
created: 2020-04-28

Σίτιση στο πρυτανείο (προνόμιο στην αρχαία Αθήνα)
notation: 2443
preferred label: Meals in the prytaneion (privilege in ancient Athens) @en
type: Concept
related: Ίδρυση ανδριάντος (απονομή τιμής)