Επαγγελματίες νοσηλευτικής
status: Εκδοθείς
related: Νοσοκομεία
related: Ιατροί
broader: Επαγγελματίες υγείας
creator: Μεργούπη-Σαβαΐδου Ειρήνη (ΑΑ)
creator: Mergoupi-Savaidou Eirini (AA) @en
source: International Labour Organization 2012
preferred label: Nursing professionals @en
contributor: Katsiadakis Helen (AA) @en
contributor: Κατσιαδάκη Ελένη (ΑΑ)
scope note: Health professionals who provide treatment, support and care services for people who are in need of nursing care due to the effects of ageing, injury, illness or other physical or mental impairment, or potential risks to health. Nursing professionals assume responsibility for the planning and management of the care of patients, including the supervision of other health care workers, working autonomously or in teams with medical doctors and others in the practical application of preventive and curative measures. @en
scope note: Οι επαγγελματίες υγείας που προσφέρουν υπηρεσίες θεραπείας, υποστήριξης και περίθαλψης σε ανθρώπους που χρειάζονται νοσηλευτική φροντίδα εξαιτίας των συνεπειών προχωρημένης ηλικίας, τραυματισμών, ασθενειών ή άλλων φυσικών και ψυχικών προβλημάτων, ή ενδεχόμενων κινδύνων για την υγεία τους. Οι επαγγελματίες νοσηλευτικής είναι υπεύθυνοι για τον σχεδιασμό και τη διαχείριση της περίθαλψης των ασθενών, καθώς και για την επίβλεψη άλλων εργαζομένων στον τομέα της περίθαλψης, δουλεύοντας αυτόνομα ή σε ομάδες με ιατρούς και άλλους επαγγελματίες για την πρακτική εφαρμογή των προληπτικών και θεραπευτικών μέτρων.
notation: 2371
alternative label: Νοσηλευτές
alternative label: Nurses @en
in scheme: HUMANITIES-THESAURUS
type: Concept
modified: 2020-04-12
created: 2020-03-19

HUMANITIES-THESAURUS
type: ConceptScheme

Νοσοκομεία
notation: 2102
preferred label: Hospitals @en
type: Concept
related: Επαγγελματίες νοσηλευτικής

Επαγγελματίες υγείας
notation: 2190
preferred label: Health professionals @en
type: Concept
narrower: Επαγγελματίες νοσηλευτικής

Ιατροί
notation: 2369
preferred label: Medical doctors @en
type: Concept
related: Επαγγελματίες νοσηλευτικής