Δαρεικοί
notation: 1829
preferred label: Darics @en
type: Concept
related: Περσικός σταθμητικός κανόνας

Σταθμητικοί κανόνες
notation: 1467
preferred label: Weight standards @en
type: Concept
narrower: Περσικός σταθμητικός κανόνας

HUMANITIES-THESAURUS
type: ConceptScheme

Περσικός σταθμητικός κανόνας
scope note: Ο σταθμητικός κανόνας που εισήχθη από τον Δαρείο Ι, ο οποίος αρχικώς ακολούθησε τον κανόνα του Κροίσου, με τον αργυρό στατήρα στα 10.75 γρ. και τον χρυσό στα 8.06 γρ. Αργότερα, υιοθέτησε χρυσό στατήρα 8.36 γρ. (δαρεικός) και αργυρό 5.5 γρ. (σίγλος).
scope note: The weight standard that was introduced by Darius I, who at first followed Croesus’ standard, with a silver stater of 10.75 gr. and a gold stater of 8.06 gr. Later on, he adopted a weight of 8.36 gr. for the gold stater (dareikos) and 5.5 gr. for the silver stater (siglos). @en
related: Νομισματική
related: Σίγλοι
related: Δαρεικοί
broader: Σταθμητικοί κανόνες
contributor: Katsiadakis Helen (AA) @en
contributor: Κατσιαδάκη Ελένη (ΑΑ)
preferred label: Persian weight standard @en
notation: 2368
in scheme: HUMANITIES-THESAURUS
type: Concept
creator: Ιακωβίδου Αθηνά (ΑΑ)
creator: Iakovidou Athena (AA) @fr
source: Psoma 2015
created: 2020-03-16
status: Εκδοθείς
modified: 2020-05-06

Σίγλοι
notation: 1851
preferred label: Sigloi @en
type: Concept
related: Περσικός σταθμητικός κανόνας

Νομισματική
notation: 1444
preferred label: Numismatics @en
type: Concept
related: Περσικός σταθμητικός κανόνας