Ταμίας των στρατιωτικών (περίοδος πόλης-κράτους)
preferred label: Treasurer of the military fund (city-state period) @en
creator: Chrysovitsanos Gerasimos (AA) @fr
creator: Χρυσοβιτσάνος Γεράσιμος (ΑΑ)
scope note: Αιρετός αξιωματούχος, στην αρχαία Ελλάδα, ο οποίος μαζί με τον ἐπὶ τῆι διοικήσει αξιωματούχο αναλάμβανε να καλύψει τα έξοδα για τη χάραξη των στηλών από το ταμείο των στρατιωτικών. Το ταμείο των στρατιωτικών δημιουργήθηκε το 373 π.Χ. με στόχο την έγκαιρη συγκέντρωση ποσών για τον πόλεμο.
scope note: Elected officer who, together with the official ἐπὶ τῆι διοικήσει (responsible for financial administration), was responsible for covering the costs of engraving inscriptions from the military fund. The military fund was created in 373 BC in order to collect war funds οn time. @en
status: Εκδοθείς
created: 2020-02-18
broader: Πολιτικά αξιώματα
modified: 2020-08-22
type: Concept
contributor: Katsiadakis Helen (AA) @en
contributor: Κατσιαδάκη Ελένη (ΑΑ)
source: Χωρέμη 2007a
in scheme: HUMANITIES-THESAURUS
notation: 2330
related: Επιγραφική

HUMANITIES-THESAURUS
type: ConceptScheme

Πολιτικά αξιώματα
notation: 1696
preferred label: Political offices @en
type: Concept
narrower: Ταμίας των στρατιωτικών (περίοδος πόλης-κράτους)

Επιγραφική
notation: 573
preferred label: Epigraphy @en
type: Concept
related: Ταμίας των στρατιωτικών (περίοδος πόλης-κράτους)