HUMANITIES-THESAURUS
type: ConceptScheme

Βοντβίλ
creator: Goulis Helen (AA) @de
creator: Γουλή Ελένη (ΑΑ)
type: Concept
source: Gidel 1986
source: Terni 2006
modified: 2020-09-30
in scheme: HUMANITIES-THESAURUS
preferred label: Vaudeville @de
notation: 2305
scope note: Θεατρικό είδος που γεννήθηκε στη Γαλλία. Ο όρος αρχικά χρησιμοποιήθηκε για να δηλώσει σατιρικά θεάματα προσανατολισμένα προς το τραγούδι, με ακροβατικά και μονολόγους. Τον 19ο αιώνα συγγραφείς όπως οι Scribe, Labiche και Feydeau εξελίσσουν το βοντβίλ σε μία ελαφρά κωμωδία πλοκής χωρίς άσματα, με έντονα φαρσικά στοιχεία, γεμάτη περιπλοκές (συνήθως ερωτικές), που ανακύπτουν από τυχαίες συναντήσεις και παρανοήσεις, συμπτώσεις και απρόοπτα. Ελληνική απομίμησή του υπήρξε το κωμειδύλλιο.
scope note: Theatrical genre born in France. Originally, the term denoted a show composed of songs, acrobatics, and monologues. In the nineteenth century, vaudeville became, with playwrights as Scribe, and then Labiche and Feydeau, a light comedy of intrigue without songs, rich in intricacies (usually erotic) that arise from chance encounters and misunderstandings, coincidences, and surprises. @en
created: 2020-01-31
alternative label: Κωμειδύλλιο
broader: Πληροφοριακά αντικείμενα
status: Εκδοθείς
contributor: Κατσιαδάκη Ελένη (ΑΑ)
contributor: Katsiadakis Helen (AA) @en

Πληροφοριακά αντικείμενα
notation: 240
preferred label: Information objects @en
type: Concept
narrower: Βοντβίλ