Μελόδραμα
status: Εκδοθείς
broader: Δράμα
preferred label: Melodram @de
preferred label: Μélodrame @fr
preferred label: Melodrama @en
source: ΕΛ.ΓΟΥ, Λεξικό 2007
source: Hays&Nikolopoulou 1999
source: Πατσαλίδης&Νικολοπούλου 2001
contributor: Vernardaki Eleni (AA) @fr
contributor: Βερναρδάκη Ελένη (ΑΑ)
creator: Goulis Helen (AA) @la
creator: Γουλή Ελένη (ΑΑ)
type: Concept
created: 2020-01-31
notation: 2303
modified: 2020-10-06
scope note: Dramatic genre that appeared in Europe at the turn of the 18th to the 19th century. The term was originally applied to scenes of mime or spoken dialogue accompanied by music. Melodrama combines prose with music to underscore dramatic effect, the tragic with the comic, spectacle with excess and codified structure with stock heroes and heroines that meet the expectations of the large audience. Melodramatic plays feature a sensational plot, an impressive adventure story, improbable and unexpected twists of fate, successive alternation of intense emotions, aiming to generate responses from the spectators, recognisability of the characters in terms of their moral standing; they deal with the eternal battle of good and evil, rendering in the end a sense of justice, with the punishment of the villains and the triumph of virtue. The genre lost its impetus early in the 20th century, but survived in various forms in modern cinema and television. @en
scope note: Δραματικό είδος που εμφανίστηκε στην Ευρώπη στο γύρισμα του 18ου προς τον 19ο αιώνα. Ο όρος κατάγεται από τη χρήση μουσικής επένδυσης σε δράματα πρόζας και παντομιμικές παραστάσεις με συνοδεία μουσικής. Το μελόδραμα συνδυάζει τον πεζό λόγο με τη μουσική υπόκρουση, το τραγικό με το κωμικό, το θέαμα με την υπερβολή και την κωδικοποιημένη δομή με στερεότυπα που ανταποκρίνονται στις προσδοκίες του ευρέως κοινού. Έχει συναρπαστική πλοκή, εξιστόρηση εντυπωσιακών περιπετειών, απροσδόκητες ανατροπές της τύχης, διαδοχική εναλλαγή έντονων συναισθημάτων που στοχεύουν στη συγκινησιακή φόρτιση των θεατών, αναγνωρισιμότητα των χαρακτήρων ως προς την ηθική τους υπόσταση, και πραγματεύεται την αιώνια μάχη του καλού με το κακό, ικανοποιώντας στο τέλος το αίσθημα του δικαίου, με την τιμωρία των κακών και το θρίαμβο της αρετής. Το είδος έχασε την απήχησή του στις αρχές του 20ού αιώνα, αλλά επιβιώνει με διάφορες μορφές στον σύγχρονο κινηματογράφο και την τηλεόραση.
in scheme: HUMANITIES-THESAURUS
alternative label: Μυθιστορηματικό δράμα

HUMANITIES-THESAURUS
type: ConceptScheme

Δράμα
notation: 1090
preferred label: Drame @fr
preferred label: Schauspiel @de
preferred label: Drama @en
type: Concept
narrower: Μελόδραμα