Προκερματικά μέσα συναλλαγής
notation: 2277
preferred label: Premonetary means of exchange @en
type: Concept
narrower: Aes grave

Aes grave
source: Amandry, Dhénin, Popoff, Thierry, & Vellet 2002
source: Burnett 1989
related: Νομίσματα (πληροφοριακά αντικείμενα)
related: Νομισματική
modified: 2020-04-03
notation: 2275
creator: Ιακωβίδου Αθηνά (ΑΑ)
creator: Iakovidou Athena (AA) @en
contributor: Κατσιαδάκη Ελένη (ΑΑ)
contributor: Katsiadakis Helen (AA) @en
broader: Προκερματικά μέσα συναλλαγής
scope note: Heavy, cast, bronze discs used as a currency in central Italy from around 280-275 BCE until the introduction of the denarii, in 211 BCE. They can be understood as a Roman hybrid between the Greek round coins and the central Italian heavy bronze currency. The basic aes grave unit, theoretically weighting a Roman pound, was the assarius. @en
scope note: Μεγάλα, χυτά, χάλκινα δισκάρια, τα οποία χρησιμοποιήθηκαν στην κεντρική Ιταλία περίπου από το 280-275 π.Χ. μέχρι και την εμφάνιση του δηναρίου, το 211 π.Χ. Μπορούν να γίνουν κατανοητά ως ένα υβρίδιο μεταξύ των ελληνικών στρογγυλών νομισμάτων και των ιταλικών βαρέων μέσων συναλλαγής από χαλκό. Βασική μονάδα των aes grave ήταν το ασσάριο, το οποίο θεωρητικά ζύγιζε όσο μία ρωμαϊκή λίβρα.
in scheme: HUMANITIES-THESAURUS
type: Concept
created: 2020-01-30
status: Εκδοθείς

Νομίσματα (πληροφοριακά αντικείμενα)
notation: 1445
preferred label: Coins (information objects) @en
type: Concept
related: Aes grave

HUMANITIES-THESAURUS
type: ConceptScheme

Νομισματική
notation: 1444
preferred label: Numismatics @en
type: Concept
related: Aes grave