HUMANITIES-THESAURUS
type: ConceptScheme

Λογοκρισία
preferred label: Censorship @en
notation: 2267
type: Concept
scope note: Ένα σύνολο τυπικών και άτυπων, εμφανών και συγκαλυμμένων πρακτικών και διαδικασιών μέσω των οποίων επιβάλλονται περιορισμοί στη συλλογή, έκθεση, διάδοση και ανταλλαγή πληροφοριών, απόψεων, ιδεών, και προϊόντων της δημιουργικής φαντασίας. Η λογοκρισία ασκείται κυρίως από δημόσια και ιδωτικά κέντρα εξουσίας, όπως οι κυβερνήσεις, οι εταιρείες, τα μέσα ενημέρωσης, οι θρησκευτικοί οργανισμοί και οι πολιτικές οργανώσεις.
scope note: A set of formal and informal, overt and covert processes by which restrictions are imposed on the collection, display, dissemination, and exchange of information, opinions, ideas, and imaginative expression. Censorship has been -and is- conducted mainly by public and private centers of power like governments, private institutions, corporations, religious, political, and media organisations. @en
broader: Λειτουργίες
contributor: Κατσιαδάκη Ελένη (ΑΑ)
contributor: Katsiadakis Helen (AA) @en
modified: 2020-04-02
creator: Τζεδόπουλος Γιώργος (ΑΑ)
creator: Tzedopoulos Giorgos (AA) @de
created: 2020-01-29
in scheme: HUMANITIES-THESAURUS
source: Jones 2015
status: Εκδοθείς

Λειτουργίες
notation: 21
preferred label: Functions @en
type: Concept
narrower: Λογοκρισία