HUMANITIES-THESAURUS
type: ConceptScheme

Προτασιακά αντικείμενα
notation: 25
preferred label: Propositional objects @en
type: Concept
narrower: Νοοτροπίες

Νοοτροπίες
source: Mandrou 1968
source: Hutton 1981
creator: Tzedopoulos Giorgos (AA) @de
creator: Τζεδόπουλος Γιώργος (ΑΑ)
in scheme: HUMANITIES-THESAURUS
contributor: Κατσιαδάκη Ελένη (ΑΑ)
contributor: Katsiadakis Helen (AA) @en
preferred label: Mentalities @en
type: Concept
notation: 2266
scope note: Οι αντιλήψεις των κοινών ανθρώπων ως προς την καθημερινή ζωή, οι οποίες περιλαμβάνουν ιδέες που αφορούν την παιδικότητα, τη σεξουαλικότητα, την οικογένεια, τον χρόνο και τον θάνατο. Η προσέγγιση αυτή συνδέεται με τη γαλλική ιστοριογραφική σχολή των Annales. Οι ιστορικοί που μελετούν τις νοοτροπίες εξετάζουν τις ψυχολογικές πραγματικότητες, στις οποίες βασίζονται οι ανθρώπινες συλλήψεις των στενών κοινωνικών σχέσεων και οι βασικές διανοητικές συμβάσεις.
scope note: Attitudes of ordinary people towards everyday life, including ideas concerning childhood, sexuality, family, time, and death. This approach is closely identified with the French Annales school of historiography. The historians who investigate mentalities examine the psychological realities underpinning human conceptions of intimate relationships and basic habits of mind. @en
status: Εκδοθείς
created: 2020-01-29
broader: Προτασιακά αντικείμενα
modified: 2020-04-02