HUMANITIES-THESAURUS
type: ConceptScheme

Παροχή γνώσης/τεχνογνωσίας
notation: 157
preferred label: Provision of knowledge and expertise @en
type: Concept
narrower: Πολιτιστική διαχείριση

Πολιτιστική διαχείριση
modified: 2020-04-02
scope note: Cultural heritage management involves the identification, protection, and stewardship of cultural heritage in the public interest. It is part of a burgeoning interest in heritage generally and the subject of increasing discussion, debate, and controversy among both specialists (including archaeologists, anthropologists, legal scholars, collectors, curators, historians, political scientists, economists, conservators, etc.) and the public. @en
scope note: Η πολιτιστική διαχείριση αφορά τον εντοπισμό, την προστασία και την εποπτεία της πολιτιστικής κληρονομιάς προς δημόσιο όφελος. Αποτελεί μέρος του αυξανόμενου ενδιαφέροντος για τον πολιτισμό και είναι το αντικείμενο συζητήσεων και αντιπαραθέσεων τόσο μεταξύ των ειδικών (αρχαιολόγων, ανθρωπολόγων, νομικών, συλλεκτών, επιμελητών, ιστορικών, πολιτικών επιστημόνων, οικονομολόγων, συντηρητών κλπ.) όσο και του κοινού.
notation: 2244
contributor: Κατσιαδάκη Ελένη (ΑΑ)
contributor: Katsiadakis Helen (AA) @en
created: 2020-01-24
broader: Παροχή γνώσης/τεχνογνωσίας
source: Elia & Ostovich 2011
creator: Τζεδόπουλος Γιώργος (ΑΑ)
creator: Tzedopoulos Giorgos (AA) @fr
type: Concept
status: Εκδοθείς
in scheme: HUMANITIES-THESAURUS
preferred label: Cultural heritage management @en