HUMANITIES-THESAURUS
type: ConceptScheme

Ιερομνήμων (περίοδος πόλης-κράτους)
notation: 2215
preferred label: Hieromnemon (city-state period) @en
type: Concept
related: Πυλαγόρας (περίοδος πόλης-κράτους)

Πυλαγόρας (περίοδος πόλης-κράτους)
created: 2020-01-13
related: Ιερομνήμων (περίοδος πόλης-κράτους)
preferred label: Pylagoras (city-state period) @en
modified: 2020-05-06
type: Concept
in scheme: HUMANITIES-THESAURUS
source: Rhodes 2006
source: Encyclopaedia Britannica 2018 (Amphictyony)
source: Κουμανούδης & Ματθαίου 1986
creator: Chrysovitsanos Gerasimos (AA) @fr
creator: Χρυσοβιτσάνος Γεράσιμος (ΑΑ)
notation: 2218
scope note: Μέλος της επιτροπής που έστελναν οι ελληνικές πόλεις κατά την αρχαιότητα ως αντιπροσώπους στα Αμφικτυονικά συνέδρια (Πυλαίαι). Οι Πυλαγόρες εκλέγονταν κάθε χρόνο και είχαν ως καθήκον την προάσπιση των συμφερόντων της πόλης τους στα Αμφικτυονικά συνέδρια.
scope note: Member of the commission sent by the Greek cities in antiquity as representatives at the Amphictyony councils (Pylaiai). The Pylagorοi were elected annually and had the duty to defend the interests of their city at the Amphictyonic councils. @en
status: Εκδοθείς
contributor: Κατσιαδάκη Ελένη (ΑΑ)
contributor: Katsiadakis Helen (AA) @en
broader: Πολιτικά αξιώματα

Πολιτικά αξιώματα
notation: 1696
preferred label: Political offices @en
type: Concept
narrower: Πυλαγόρας (περίοδος πόλης-κράτους)