HUMANITIES-THESAURUS
type: ConceptScheme

Ρόλοι (θέατρο)
notation: 625
preferred label: Roles @en
preferred label: Rolle @de
preferred label: Rôles @fr
type: Concept
narrower: Ενζενί

Ενζενί
contributor: Katsiadakis Helen (AA) @de
contributor: Κατσιαδάκη Ελένη (ΑΑ)
creator: Γουλή Ελένη (ΑΑ)
creator: Goulis Helen (AA) @de
modified: 2020-09-30
source: Kennedy 2005
scope note: The ingénue is a stock character in literature, film, and a role type in the theatre. Typically, a girl or a young woman who is endearingly innocent, beautiful, and often naïve, in mental or emotional danger rather than physical danger. Ingénue may also refer to a new young actress or one typecast in such roles. @en
scope note: Στερεοτυπικός χαρακτήρας στη λογοτεχνία και τον κινηματογράφο και τύπος ρόλου στο θέατρο. Πρόκειται για μια κοπέλα ή νεαρή γυναίκα όμορφη και αξιαγάπητη στην αφέλειά της, συχνά απλοϊκή, που βρίσκεται συνήθως σε ψυχικό ή συναισθηματικό κίνδυνο παρά σε φυσικό. Ο όρος μπορεί επίσης να αναφέρεται σε μια πρωτοεμφανιζόμενη νεαρή ηθοποιό ή σε μια τυπολογία τέτοιων ρόλων.
preferred label: Ingenue @de
preferred label: Ingénue @fr
created: 2019-12-31
notation: 2208
broader: Ρόλοι (θέατρο)
status: Εκδοθείς
in scheme: HUMANITIES-THESAURUS
type: Concept