HUMANITIES-THESAURUS
type: ConceptScheme

Συστήματα επικοινωνίας
notation: 2158
preferred label: Communication systems @en
type: Concept
narrower: Κατασκευασμένες γλώσσες

Κατασκευασμένες γλώσσες
contributor: Κατσιαδάκη Ελένη (ΑΑ)
contributor: Katsiadakis Helen (AA) @en
source: Καρασίμος 2018
source: Κατσογιάννου 2018
source: Eco 1995
preferred label: Constructed languages @en
notation: 2197
in scheme: HUMANITIES-THESAURUS
type: Concept
modified: 2020-08-21
creator: Karasimos Athanasios (AA) @fr
creator: Καρασίμος Αθανάσιος (ΑΑ)
created: 2019-12-19
scope note: A constructed language (sometimes called a conlang) is a language whose phonology, grammar, and vocabulary, instead of having developed naturally, are consciously devised. Constructed languages may also be referred to as artificial languages, planned languages or invented languages and in some cases fictional languages. Planned languages are languages that have been purposefully designed. They are the result of deliberate controlling intervention, thus of a form of language planning. @en
scope note: Κατασκευασμένη γλώσσα είναι το σύστημα επικοινωνίας του οποίου η γραμματική και το λεξιλόγιο, έχουν επινοηθεί συνειδητά από ένα άτομο ή μια ομάδα, αντί να έχουν εξελιχθεί φυσικά. Υπάρχουν πολλοί πιθανοί λόγοι για να δημιουργηθεί μια τεχνητή γλώσσα: από το να διευκολύνει την ανθρώπινη επικοινωνία, μέχρι να φέρει έναν φανταστικό ή κατασκευασμένο κόσμο στην ζωή. Επίσης για τον γλωσσικό πειραματισμό ή για λόγους καλλιτεχνικής δημιουργίας και έκφρασης. Τέλος μπορεί να δημιουργηθεί για γλωσσικά παιχνίδια.
status: Εκδοθείς
broader: Συστήματα επικοινωνίας