HUMANITIES-THESAURUS
type: ConceptScheme

Κατάλογοι πεσόντων
broader: Κατάλογοι (Επιγραφές δημοσίου χαρακτήρα)
status: Εκδοθείς
in scheme: HUMANITIES-THESAURUS
creator: Χρυσοβιτσάνος Γεράσιμος (ΑΑ)
creator: Chrysovitsanos Gerasimos (AA) @fr
notation: 2161
contributor: Κατσιαδάκη Ελένη (ΑΑ)
contributor: Katsiadakis Helen (AA) @en
type: Concept
modified: 2020-04-28
scope note: Inscriptions containing lists of names of men fallen in battles. It was common for these lists to be used as funerary inscriptions erected by decision of the Council and the Assembly. @en
scope note: Επιγραφές που περιέχουν καταλόγους με ονόματα πεσόντων σε μάχες. Ήταν σύνηθες το φαινόμενο οι κατάλογοι αυτοί να αποτελούν και επιτύμβιες επιγραφές που ανεγείρονταν με απόφαση της Βουλής και της εκκλησίας του Δήμου.
preferred label: Casualty lists @en
source: Bradeen 1967
source: Οικονομάκη & Τζιφόπουλος 2015
created: 2019-11-07

Κατάλογοι (Επιγραφές δημοσίου χαρακτήρα)
notation: 1093
preferred label: Catalogues (Public inscriptions) @en
type: Concept
narrower: Κατάλογοι πεσόντων