Engineered languages
notation: 2213
preferred label: Μηχανικές γλώσσες @el
type: Concept
broader: Techincal languages

Techincal languages
source: Eco 1995
source: Καρασίμος 2018
scope note: Τεχνητή ή κατασκευασμένη γλώσσα είναι το σύστημα επικοινωνίας του οποίου η γραμματική και το λεξιλόγιο, έχουν επινοηθεί συνειδητά από ένα άτομο ή μια ομάδα, αντί να έχουν εξελιχθεί φυσικά. Υπάρχουν πολλοί πιθανοί λόγοι για να δημιουργηθεί μια τεχνητή γλώσσα: από το να διευκολύνει την ανθρώπινη επικοινωνία, μέχρι να φέρει έναν φανταστικό ή κατασκευασμένο κόσμο στην ζωή. Επίσης για τον γλωσσικό πειραματισμό ή για λόγους καλλιτεχνικής δημιουργίας και έκφρασης. Τέλος μπορεί να δημιουργηθεί για γλωσσικά παιχνίδια. @el
scope note: A constructed language (sometimes called a conlang) is a language whose phonology, grammar, and vocabulary, instead of having developed naturally, are consciously devised. Constructed languages may also be referred to as artificial languages, planned languages or invented languages and in some cases fictional languages. Planned languages are languages that have been purposefully designed. They are the result of deliberate controlling intervention, thus of a form of language planning.
alternative label: Artificial languages
alternative label: Non-human languages
alternative label: Constructed languages
alternative label: Μη-ανθρώπινες γλώσσες @el
modified: 2020-11-11
preferred label: Τεχνητές γλώσσες @el
contributor: Κατσιαδάκη Ελένη (ΑΑ) @el
contributor: Katsiadakis Helen (AA)
narrower: A posteriori languages
narrower: Engineered languages
created: 2019-11-06
type: Concept
creator: Karasimos Athanasios (AA) @fr
creator: Καρασίμος Αθανάσιος (ΑΑ) @el
in scheme: HUMANITIES-THESAURUS
status: Εκδοθείς
notation: 2159
broader: Communication systems

A posteriori languages
notation: 2185
preferred label: A posteriori τεχνητές γλωσσες @el
type: Concept
broader: Techincal languages

HUMANITIES-THESAURUS
type: ConceptScheme

Communication systems
notation: 2158
preferred label: Συστήματα επικοινωνίας @el
type: Concept
narrower: Techincal languages