Αστρολάβοι
contributor: Κατσιαδάκη Ελένη (ΑΑ)
contributor: Katsiadakis Helen (AA) @en
in scheme: HUMANITIES-THESAURUS
modified: 2020-06-29
preferred label: Astrolabes @en
broader: Επιστημονικά όργανα
related: Ναυσιπλοΐα
related: Αστρονομία
source: Bennett 2003a
source: Wintroub 2000
created: 2019-10-29
status: Εκδοθείς
creator: Μεργούπη-Σαβαΐδου Ειρήνη (ΑΑ)
creator: Mergoupi-Savaidou Eirini (AA) @en
type: Concept
scope note: Instruments used widely from Antiquity until around the 17th century in observational astronomy and navigation for complex astronomical and geometrical calculations with respect to the positions of the Sun, planets and stars, time, geographical latitude and the direction of the North, as well as the determination of horoscopes in astrology. @en
scope note: Όργανα που χρησιμοποιούνταν ευρέως από την Αρχαιότητα έως περίπου τον 17ο αιώνα στην παρατηρησιακή αστρονομία και τη ναυσιπλοΐα, για την πραγματοποίηση σύνθετων αστρονομικών και γεωμετρικών υπολογισμών σχετικά με τις θέσεις του Ήλιου, των πλανητών και των άστρων, την ώρα, το γεωγραφικό μήκος και την κατεύθυνση του Βορρά, αλλά και για τον προσδιορισμό των ωροσκοπίων στην αστρολογία.
notation: 2106

Ναυσιπλοΐα
notation: 1495
preferred label: Navigation @en
type: Concept
related: Αστρολάβοι

Επιστημονικά όργανα
notation: 1888
preferred label: Scientific instruments @en
type: Concept
narrower: Αστρολάβοι

HUMANITIES-THESAURUS
type: ConceptScheme

Αστρονομία
notation: 2195
preferred label: Astronomy @en
type: Concept
related: Αστρολάβοι