Βιολογία
notation: 1602
preferred label: Biology @en
type: Concept
related: Μικροσκόπια

Επιστημονικά όργανα
notation: 1888
preferred label: Scientific instruments @en
type: Concept
narrower: Μικροσκόπια

HUMANITIES-THESAURUS
type: ConceptScheme

Βοτανική
notation: 1603
preferred label: Botany @en
type: Concept
related: Μικροσκόπια

Ιατρική
notation: 2377
preferred label: Medicine @en
type: Concept
related: Μικροσκόπια

Μικροσκόπια
related: Βιολογία
related: Βοτανική
related: Ιατρική
preferred label: Microscopes @en
status: Εκδοθείς
creator: Μεργούπη-Σαβαΐδου Ειρήνη (ΑΑ)
creator: Mergoupi-Savaidou Eirini (AA) @en
scope note: Scientific instruments that utilize rays for the magnification of small objects, which may be viewed directly, photographed or recorded electronically. Microscopes were invented around the early seventeenth century and have played a crucial role for the advancement of biomedical and physical sciences. @en
scope note: Επιστημονικά όργανα που χρησιμοποιούν ακτινοβολία για τη μεγέθυνση μικρών αντικειμένων, προκειμένου αυτά να παρατηρηθούν απευθείας, να φωτογραφηθούν ή να αποτυπωθούν ηλεκτρονικά. Αποτελούν εφεύρεση των αρχών περίπου του δεκάτου εβδόμου αιώνα και έχουν συμβάλει καθοριστικά στην ανάπτυξη των βιοϊατρικών και φυσικών επιστημών.
contributor: Mergoupi-Savaidou Eirini (AA) @fr
contributor: Μεργούπη-Σαβαΐδου Ειρήνη (ΑΑ)
broader: Επιστημονικά όργανα
type: Concept
modified: 2020-06-27
notation: 2103
in scheme: HUMANITIES-THESAURUS
source: Schickore 2003
created: 2019-10-29