HUMANITIES-THESAURUS
type: ConceptScheme

Αποσβέσεις γραμμάτων επιγραφών
notation: 2096
preferred label: Rasurae @en
type: Concept
related: Καταδίκη μνήμης

Καταδίκη μνήμης
source: Μοσχονάς 2015
source: Varner 2004
source: Keppie 1991
preferred label: Damnatio memoriae @la
type: Concept
status: Εκδοθείς
contributor: Κατσιαδάκη Ελένη (ΑΑ)
contributor: Katsiadakis Helen (AA) @en
in scheme: HUMANITIES-THESAURUS
created: 2019-10-24
scope note: A procedure that appears in ancient Rome, according to which the Senate, the emperor, or even the army imposed a "condemnation of memory" on persons, who were considered dangerous for the safety of the state due to their actions. The punishment involved the elimination of any testimony of the person's existence and was accompanied by confiscation of his property, withdrawal, alteration, or destruction of sculptures and other illustrations and the scraping of his name from inscriptions and public texts etc. @en
scope note: Διαδικασία που απαντά στην αρχαία Ρώμη, κατά την οποία η Σύγκλητος, o αυτοκράτορας ή ακόμη και ο στρατός επέβαλλε την "καταδίκη μνήμης" προσώπων που λόγω των πράξεών τους κρίθηκαν επικίνδυνοι για την ασφάλεια του κράτους. Η ποινή σήμαινε την απάλειψη κάθε μαρτυρίας της ύπαρξης του προσώπου και συνοδευόταν από δήμευση περιουσίας, απόσυρση, διασκευή ή καταστροφή γλυπτών και άλλων απεικονίσεων, την απόξεση του ονόματός του από επιγραφές και δημόσια κείμενα κ.ά.
modified: 2020-10-19
notation: 2095
creator: Χρυσοβιτσάνος Γεράσιμος (ΑΑ)
creator: Chrysovitsanos Gerasimos (AA) @fr
broader: Διαδικασίες
related: Αποσβέσεις γραμμάτων επιγραφών

Διαδικασίες
notation: 285
preferred label: Procedures @en
type: Concept
narrower: Καταδίκη μνήμης