Οδοποιοί (Συλλογικές αρχές)
creator: Ιακωβίδου Αθηνά (ΑΑ)
creator: Iakovidou Athena (AA) @fr
scope note: Άρχοντες που απαντούν στην αρχαία Αθήνα. Οι οδοποιοί ήταν πέντε στον αριθμό και επιλέγονταν ετησίως με κλήρο. Είχαν ως αποστολή να συντηρούν τις οδούς της πόλεως χρησιμοποιώντας ως εργάτες δημόσιους δούλους.
scope note: Magistrates in ancient Athens. The hodopoioi were five in number, appointed by lot annually. Their duty was to keep the roads in a good condition, employing public slaves as workmen. @en
broader: Συλλογικές αρχές (αρχαία Ελλάδα)
source: Σακελλαρίου 2004
source: Pritchett 1965
created: 2019-10-08
modified: 2020-10-10
related: Οδοποιός (αρχαία Αθήνα)
contributor: Katsiadakis Helen (AA) @en
contributor: Κατσιαδάκη Ελένη (ΑΑ)
type: Concept
notation: 2079
preferred label: Hodopoioi (Collective authorities) @en
status: Εκδοθείς
in scheme: HUMANITIES-THESAURUS

HUMANITIES-THESAURUS
type: ConceptScheme

Οδοποιός (αρχαία Αθήνα)
notation: 2078
preferred label: Hodopoios (ancient Athens) @en
type: Concept
related: Οδοποιοί (Συλλογικές αρχές)

Συλλογικές αρχές (αρχαία Ελλάδα)
notation: 2622
preferred label: Collective authorities (ancient Greece) @en
type: Concept
narrower: Οδοποιοί (Συλλογικές αρχές)