HUMANITIES-THESAURUS
type: ConceptScheme

Επισκευαστής (αρχαία Αθήνα)
notation: 2072
preferred label: Episkeuastes (ancient Athens) @en
type: Concept
related: Επισκευασταί (Συλλογικές αρχές)

Επισκευασταί (Συλλογικές αρχές)
scope note: Magistrates in ancient Athens. The episkeuastai were ten men, selected by lot each year. Their duty was to repair those sanctuaries especially in need of it. For this purpose they received 30 mnai from the Apodektai. @en
scope note: Άρχοντες που απαντούν στην αρχαία Αθήνα. Οι επισκευαστές, δέκα στον αριθμό και αναδεικνυόμενοι με κλήρο, προέβαιναν σε επισκευές των ιερών που είχαν μεγαλύτερη ανάγκη. Για τον σκοπό αυτό λάμβαναν από τους αποδέκτες το ποσό των 30 μνων.
source: Mikalson 2016
source: Σακελλαρίου 2004
type: Concept
creator: Ιακωβίδου Αθηνά (ΑΑ)
creator: Iakovidou Athena (AA) @fr
related: Επισκευαστής (αρχαία Αθήνα)
preferred label: Episkeuastai (Collective authorities) @en
notation: 2073
alternative label: Επισκευαστές (Συλλογικές αρχές)
contributor: Κατσιαδάκη Ελένη (ΑΑ)
contributor: Katsiadakis Helen (AA) @en
status: Εκδοθείς
modified: 2020-10-10
broader: Συλλογικές αρχές (αρχαία Ελλάδα)
created: 2019-10-04
in scheme: HUMANITIES-THESAURUS

Συλλογικές αρχές (αρχαία Ελλάδα)
notation: 2622
preferred label: Collective authorities (ancient Greece) @en
type: Concept
narrower: Επισκευασταί (Συλλογικές αρχές)