Αστυνόμοι (Συλλογικές αρχές)
source: Lanni 2016
source: Σακελλαρίου 2004
source: Arnaoutoglou 1998
in scheme: HUMANITIES-THESAURUS
preferred label: Astynomoi (Collective authorities) @en
related: Αστυνόμος (αρχαία Αθήνα)
related: Αμφοδάρχαι (Συλλογικές αρχές)
notation: 2069
modified: 2020-10-10
type: Concept
contributor: Katsiadakis Helen (AA) @en
contributor: Κατσιαδάκη Ελένη (ΑΑ)
created: 2019-10-03
status: Εκδοθείς
creator: Iakovidou Athena (AA) @la
creator: Ιακωβίδου Αθηνά (ΑΑ)
broader: Συλλογικές αρχές (αρχαία Ελλάδα)
scope note: Magistrates encountered in many ancient Greek states, mainly Ionian. In Athens, there were five for the city and five for Piraeus. Their principal duties were to enforce building regulations, keep the streets and sanctuaries clean and free from obstructions and supervise the hiring prices for certain categories of entertainers. They also had the power to impose fines or bring the perpetrators to trial in an heliastic court under their presidency. @en
scope note: Άρχοντες της αρχαίας Ελλάδας που απαντούν κυρίως σε πόλεις της Ιωνίας. Στην Αθήνα οι αστυνόμοι ήταν πέντε για την πόλη και πέντε για τον Πειραιά. Ήταν κυρίως επιφορτισμένοι με την τήρηση πολεοδομικών κανονισμών, την καθαριότητα και την εφαρμογή διατάξεων για την μίσθωση ορισμένων διασκεδαστών για συμπόσια. Σε περίπτωση που δεν εκτελούνταν οι διαταγές τους, είτε επέβαλλαν πρόστιμο, είτε παρέπεμπαν τον υπαίτιο σε ηλιαστικό Δικαστήριο υπό την προεδρία τους.

Αμφοδάρχαι (Συλλογικές αρχές)
notation: 2615
preferred label: Amphodarchai (Collective authorities) @en
type: Concept
related: Αστυνόμοι (Συλλογικές αρχές)

HUMANITIES-THESAURUS
type: ConceptScheme

Συλλογικές αρχές (αρχαία Ελλάδα)
notation: 2622
preferred label: Collective authorities (ancient Greece) @en
type: Concept
narrower: Αστυνόμοι (Συλλογικές αρχές)

Αστυνόμος (αρχαία Αθήνα)
notation: 2068
preferred label: Astynomos (ancient Athens) @en
type: Concept
related: Αστυνόμοι (Συλλογικές αρχές)