HUMANITIES-THESAURUS
type: ConceptScheme

Ελαιοκομία
scope note: Κλάδος της γεωργίας που ασχολείται με την καλλιέργεια ελαιόδενδρων.
scope note: Branch of horticulture which deals with the cultivation of olive trees. @en
contributor: Κατσιαδάκη Ελένη (ΑΑ)
contributor: Katsiadakis Helen (AA) @en
creator: Falierou Anastasia (AA) @la
creator: Φαλιέρου Αναστασία (ΑΑ)
alternative label: Olive cultivation @en
status: Εκδοθείς
created: 2019-10-02
in scheme: HUMANITIES-THESAURUS
type: Concept
modified: 2019-10-27
source: Ήμελλου & Πολυμέρου-Καμηλάκη 1983
broader: Γεωργία
preferred label: Olive farming @en
notation: 2063

Γεωργία
notation: 148
preferred label: Horticulture @en
type: Concept
narrower: Ελαιοκομία