HUMANITIES-THESAURUS
type: ConceptScheme

Trierarchies
creator: Chrysovitsanos Gerasimos (AA)
creator: Χρυσοβιτσάνος Γεράσιμος (ΑΑ) @el
scope note: Μία εκ των λειτουργιών με έκτακτο χαρακτήρα που σχετίζεται με τη ναυτική δύναμη της αρχαίας Αθήνας. Aπό τον πρώιμο 5ο αιώνα, oι Αθηναίοι στρατηγοί επέλεγαν για ένα χρόνο από τους ευπορότερους πολίτες τόσους τριήραρχους, όσες και οι τριήρεις που θα επανδρώνονταν. Τα έξοδα αφορούσαν τόσο την επισκευή και συντήρηση του πλοίου, όσο και την διατροφή και πληρωμή του πληρώματος. Ο θεσμός της τριηραρχίας παύει να υπάρχει το 307 π.Χ. @el
scope note: One of the occasional liturgies associated with the naval power of ancient Athens. From the early 5th century the Athenian strategoi chose for one year from the wealthiest citizens a number of trierarchs corresponding to the number of triremes to be manned. The costs involved the expenses both for the repair and maintenance of the ship and for the food and payment of the crew. The institution of trierarchy was abolished in 307 BC.
type: Concept
modified: 2020-04-06
contributor: Katsiadakis Helen (AA)
contributor: Κατσιαδάκη Ελένη (ΑΑ) @el
broader: Liturgies (Ancient Greece)
preferred label: Τριηραρχίες @el
created: 2019-09-18
notation: 2026
source: Starr C. G. 1970
status: Εκδοθείς
in scheme: HUMANITIES-THESAURUS

Liturgies (Ancient Greece)
notation: 1988
preferred label: Λειτουργίες (Αρχαία Ελλάδα) @el
type: Concept
narrower: Trierarchies