Τεχνικές των Εικαστικών Τεχνών
notation: 378
preferred label: Visual Arts Techniques @en
type: Concept
narrower: Κιαροσκούρο

HUMANITIES-THESAURUS
type: ConceptScheme

Κιαροσκούρο
modified: 2020-10-11
contributor: Δασκαλοθανάσης Νίκος (ΑΣΚΤ)
contributor: Daskalothanasis Nikos (ASFA) @de
in scheme: HUMANITIES-THESAURUS
broader: Τεχνικές των Εικαστικών Τεχνών
created: 2019-09-15
scope note: Ιταλικός όρος (που σημαίνει «φωτεινό-σκοτεινό») και αναφέρεται στην ισορροπία μεταξύ φωτός και σκιάς σε ένα ζωγραφικό πίνακα ή σχέδιο, ιδίως όταν έτσι παράγεται έντονη μεταξύ τους αντίθεση.
scope note: Chiaroscuro is an Italian term which translates as light-dark, and refers to the balance and pattern of light and shade in a painting or drawing. Chiaroscuro is generally only remarked upon when it is a particularly prominent feature of the work, usually when the artist is using extreme contrasts of light and shade. @en
source: Ρηντ κ.ά. 1986
creator: Chatzi Maria (ASFA) @la
creator: Χατζή Μαρία (ΑΣΚΤ)
type: Concept
preferred label: Chiaroscuro @en
status: Εκδοθείς
notation: 2011