HUMANITIES-THESAURUS
type: ConceptScheme

Αντιδόσις
notation: 2065
preferred label: Antidosis @en
type: Concept
related: Λειτουργίες (Αρχαία Ελλάδα)

Τριηραρχίες
notation: 2026
preferred label: Trierarchies @en
type: Concept
broader: Λειτουργίες (Αρχαία Ελλάδα)

Λειτουργίες (Αρχαία Ελλάδα)
contributor: Χρυσοβιτσάνος Γεράσιμος (ΑΑ)
contributor: Chrysovitsanos Gerasimos (AA) @la
scope note: In ancient Athens certain public mandatory duties conferred upon the wealthiest citizens. The constitution of liturgies was a kind of indirect regular or occasional taxation. Regular liturgies were the choregia, gymnasiarchy etc. while trierarchies and eisphora were occasional. @en
scope note: Με τον όρο Λειτουργίες στην αρχαία Αθήνα νοείται το σύνολο υποχρεωτικών αναθέσεων δημοσίων λειτουργιών στους ευπορότερους πολίτες. Αποτελούσε ένα είδος έμμεσης φορολογίας τακτικής ή έκτακτης. Τακτικές ήταν η χορηγία, η γυμνασιαρχία κα, ενώ έκτακτο χαρακτήρα είχαν οι τριηραρχίες και η εισφορά.
created: 2019-09-06
creator: Chrysovitsanos Gerasimos (AA) @fr
creator: Χρυσοβιτσάνος Γεράσιμος (ΑΑ)
related: Αντιδόσις
narrower: Τριηραρχίες
in scheme: HUMANITIES-THESAURUS
notation: 1988
preferred label: Liturgies (Ancient Greece) @en
modified: 2020-03-23
status: Εκδοθείς
source: Jones 1970
broader: Λειτουργίες
type: Concept

Λειτουργίες
notation: 21
preferred label: Functions @en
type: Concept
narrower: Λειτουργίες (Αρχαία Ελλάδα)