HUMANITIES-THESAURUS
type: ConceptScheme

Φαροφύλακες
in scheme: HUMANITIES-THESAURUS
modified: 2019-07-23
broader: Επαγγελματικές ομάδες
contributor: Κατσιαδάκη Ελένη (ΑΑ)
contributor: Katsiadakis Helen (AA) @en
scope note: Persons responsible for the operation, maintenance and control of a lighthouse. @en
scope note: Πρόσωπα υπεύθυνα για τη φύλαξη, τη συντήρηση και τον έλεγχο της λειτουργίας ενός φάρου.
preferred label: Lighthouse guardians @en
creator: Falierou Anastasia (AA) @la
creator: Φαλιέρου Αναστασία (ΑΑ)
status: Εκδοθείς
created: 2019-07-17
source: Χαραλαμπάκης 2014
notation: 1871
type: Concept

Επαγγελματικές ομάδες
notation: 289
preferred label: Occupational groups @en
type: Concept
narrower: Φαροφύλακες